Reaction Details
TargetCoagulation factor XII
LigandBDBM22737
Substrate/CompetitorBDBM22723
Meas. Tech.Enzyme Inhibition Assay
pH7.4±n/a
Temperature298.15±n/a K
Ki 18.2±3.6 nM
Citation Wadkins, RMHyatt, JLWei, XYoon, KJWierdl, MEdwards, CCMorton, CLObenauer, JCDamodaran, KBeroza, PDanks, MKPotter, PM Identification and characterization of novel benzil (diphenylethane-1,2-dione) analogues as inhibitors of mammalian carboxylesterases. J Med Chem48:2906-15 (2005) 
 
Coagulation factor XII
Name:Coagulation factor XII
Type:Enzyme
Mol. Mass.:67810.07
Organism:Homo sapiens (Human)
Description:P00748
Residue:615
BDBM22737
BDBM22723
NameBDBM22737
Synonyms:1-(4-chlorophenyl)-2-phenylethane-1,2-dione | Benzil-based compound, 15
TypeSmall organic molecule
Emp. Form.C14H9ClO2
Mol. Mass.244.673
SMILESClc1ccc(cc1)C(=O)C(=O)c1ccccc1