Reaction Details
TargetCoagulation factor XII
LigandBDBM22739
Substrate/CompetitorBDBM22723
Meas. Tech.Enzyme Inhibition Assay
pH7.4±n/a
Temperature298.15±n/a K
Ki 33.3±6.0 nM
Citation Wadkins, RMHyatt, JLWei, XYoon, KJWierdl, MEdwards, CCMorton, CLObenauer, JCDamodaran, KBeroza, PDanks, MKPotter, PM Identification and characterization of novel benzil (diphenylethane-1,2-dione) analogues as inhibitors of mammalian carboxylesterases. J Med Chem48:2906-15 (2005) 
 
Coagulation factor XII
Name:Coagulation factor XII
Type:Enzyme
Mol. Mass.:67810.07
Organism:Homo sapiens (Human)
Description:P00748
Residue:615
BDBM22739
BDBM22723
NameBDBM22739
Synonyms:1-(4-methylphenyl)-2-phenylethane-1,2-dione | Benzil-based compound, 17
TypeSmall organic molecule
Emp. Form.C15H12O2
Mol. Mass.224.2546
SMILESCc1ccc(cc1)C(=O)C(=O)c1ccccc1