Reaction Details
TargetCoagulation factor XII
LigandBDBM22740
Substrate/CompetitorBDBM22723
Meas. Tech.Enzyme Inhibition Assay
pH7.4±n/a
Temperature298.15±n/a K
Ki 60.4±6.0 nM
Citation Wadkins, RMHyatt, JLWei, XYoon, KJWierdl, MEdwards, CCMorton, CLObenauer, JCDamodaran, KBeroza, PDanks, MKPotter, PM Identification and characterization of novel benzil (diphenylethane-1,2-dione) analogues as inhibitors of mammalian carboxylesterases. J Med Chem48:2906-15 (2005) 
 
Coagulation factor XII
Name:Coagulation factor XII
Type:Enzyme
Mol. Mass.:67810.07
Organism:Homo sapiens (Human)
Description:P00748
Residue:615
BDBM22740
BDBM22723
NameBDBM22740
Synonyms:1,2-bis(4-methylphenyl)ethane-1,2-dione | Benzil-based compound, 18
TypeSmall organic molecule
Emp. Form.C16H14O2
Mol. Mass.238.2812
SMILESCc1ccc(cc1)C(=O)C(=O)c1ccc(C)cc1