Reaction Details
TargetLiver carboxylesterase 1
LigandBDBM22722
Substrate/CompetitorBDBM22723
Meas. Tech.Enzyme Inhibition Assay
Ki 45.1±n/a nM
Citation Wadkins, RMHyatt, JLWei, XYoon, KJWierdl, MEdwards, CCMorton, CLObenauer, JCDamodaran, KBeroza, PDanks, MKPotter, PM Identification and characterization of novel benzil (diphenylethane-1,2-dione) analogues as inhibitors of mammalian carboxylesterases. J Med Chem48:2906-15 (2005) 
 
Liver carboxylesterase 1
Name:Liver carboxylesterase 1
Type:Protein
Mol. Mass.:62520.83
Organism:Homo sapiens (Human)
Description:n/a
Residue:567
BDBM22722
BDBM22723
NameBDBM22722
Synonyms:1,2-diphenylethane-1,2-dione CHEMBL189886 | Diphenylethane-1,2-dione
TypeSmall organic molecule
Emp. Form.C14H10O2
Mol. Mass.210.228
SMILESO=C(C(=O)c1ccccc1)c1ccccc1