Reaction Details
TargetLiver carboxylesterase 1
LigandBDBM22749
Substrate/CompetitorBDBM22723
Meas. Tech.Enzyme Inhibition Assay
Ki 21.7±n/a nM
Citation Wadkins, RMHyatt, JLWei, XYoon, KJWierdl, MEdwards, CCMorton, CLObenauer, JCDamodaran, KBeroza, PDanks, MKPotter, PM Identification and characterization of novel benzil (diphenylethane-1,2-dione) analogues as inhibitors of mammalian carboxylesterases. J Med Chem48:2906-15 (2005) 
 
Liver carboxylesterase 1
Name:Liver carboxylesterase 1
Type:Enzyme
Mol. Mass.:62292
Organism:Oryctolagus cuniculus (rabbit)
Description:n/a
Residue:565
BDBM22749
BDBM22723
NameBDBM22749
Synonyms:1-(4-nitrophenyl)-2-phenylethane-1,2-dione | Benzil-based compound, 27
TypeSmall organic molecule
Emp. Form.C14H9NO4
Mol. Mass.255.2256
SMILES[O-][N+](=O)c1ccc(cc1)C(=O)C(=O)c1ccccc1