Reaction Details
TargetLiver carboxylesterase 1
LigandBDBM22751
Substrate/CompetitorBDBM22723
Meas. Tech.Enzyme Inhibition Assay
Ki 267±n/a nM
Citation Wadkins, RMHyatt, JLWei, XYoon, KJWierdl, MEdwards, CCMorton, CLObenauer, JCDamodaran, KBeroza, PDanks, MKPotter, PM Identification and characterization of novel benzil (diphenylethane-1,2-dione) analogues as inhibitors of mammalian carboxylesterases. J Med Chem48:2906-15 (2005) 
 
Liver carboxylesterase 1
Name:Liver carboxylesterase 1
Type:Enzyme
Mol. Mass.:62292
Organism:Oryctolagus cuniculus (rabbit)
Description:n/a
Residue:565
BDBM22751
BDBM22723
NameBDBM22751
Synonyms:1,2-bis(3-nitrophenyl)ethane-1,2-dione | Benzil-based compound, 29
TypeSmall organic molecule
Emp. Form.C14H8N2O6
Mol. Mass.300.2231
SMILES[O-][N+](=O)c1cccc(c1)C(=O)C(=O)c1cccc(c1)[N+]([O-])=O