Reaction Details
TargetLiver carboxylesterase 1
LigandBDBM22782
Substrate/CompetitorBDBM22723
Meas. Tech.Enzyme Inhibition Assay
Ki 54.8±n/a nM
Citation Wadkins, RMHyatt, JLWei, XYoon, KJWierdl, MEdwards, CCMorton, CLObenauer, JCDamodaran, KBeroza, PDanks, MKPotter, PM Identification and characterization of novel benzil (diphenylethane-1,2-dione) analogues as inhibitors of mammalian carboxylesterases. J Med Chem48:2906-15 (2005) 
 
Liver carboxylesterase 1
Name:Liver carboxylesterase 1
Type:Enzyme
Mol. Mass.:62292
Organism:Oryctolagus cuniculus (rabbit)
Description:n/a
Residue:565
BDBM22782
BDBM22723
NameBDBM22782
Synonyms:2,3,5,6-tetrachlorocyclohexa-2,5-diene-1,4-dione Benzil-related compound, 57 | acs.jmedchem.1c00409_ST.350
TypeSmall organic molecule
Emp. Form.C6Cl4O2
Mol. Mass.245.875
SMILESClC1=C(Cl)C(=O)C(Cl)=C(Cl)C1=O