Reaction Details
TargetAcetylcholinesterase
LigandBDBM22749
Substrate/CompetitorBDBM8959
Meas. Tech.Enzyme Inhibition Assay
Ki>100000±n/a nM
Citation Wadkins, RMHyatt, JLWei, XYoon, KJWierdl, MEdwards, CCMorton, CLObenauer, JCDamodaran, KBeroza, PDanks, MKPotter, PM Identification and characterization of novel benzil (diphenylethane-1,2-dione) analogues as inhibitors of mammalian carboxylesterases. J Med Chem48:2906-15 (2005) 
 
Acetylcholinesterase
Name:Acetylcholinesterase
Type:Enzyme
Mol. Mass.:67792.70
Organism:Homo sapiens (Human)
Description:P22303
Residue:614
BDBM22749
BDBM8959
NameBDBM22749
Synonyms:1-(4-nitrophenyl)-2-phenylethane-1,2-dione | Benzil-based compound, 27
TypeSmall organic molecule
Emp. Form.C14H9NO4
Mol. Mass.255.2256
SMILES[O-][N+](=O)c1ccc(cc1)C(=O)C(=O)c1ccccc1