Reaction Details
TargetAP2-associated protein kinase 1
LigandBDBM311218
Substrate/Competitorn/a
Meas. Tech.Kinase Assay
IC50 0.070±n/a nM
Citation Luo, GChen, LDzierba, CDDitta, JLMacor, JEBronson, JJ Biaryl kinase inhibitors US Patent US9902722 Publication Date 2/27/2018
 
AP2-associated protein kinase 1
Name:AP2-associated protein kinase 1
Type:PROTEIN
Mol. Mass.:103884.23
Organism:Homo sapiens (Human)
Description:ChEMBL_774569
Residue:961
BDBM311218
NameBDBM311218
Synonyms:(S)-1-(2-cyclopropyl-4-(quinolin-4-yl)phenoxy)-2,4-dimethylpentan-2-amine US10351563, Example 74 US10981910, Example 74 | US9902722, Example 74
TypeSmall organic molecule
Emp. Form.C25H30N2O
Mol. Mass.374.5185
SMILESCC(C)C[C@](C)(N)COc1ccc(cc1C1CC1)-c1ccnc2ccccc12