Reaction Details
TargetCoagulation factor XII
LigandBDBM22795
Substrate/CompetitorBDBM22723
Meas. Tech.Enzyme Inhibition Assay
pH7.4±n/a
Temperature298.15±n/a K
Ki 32±3 nM
Citation Hyatt, JLMoak, THatfield, MJTsurkan, LEdwards, CCWierdl, MDanks, MKWadkins, RMPotter, PM Selective inhibition of carboxylesterases by isatins, indole-2,3-diones. J Med Chem50:1876-85 (2007) 
 
Coagulation factor XII
Name:Coagulation factor XII
Type:Enzyme
Mol. Mass.:67810.07
Organism:Homo sapiens (Human)
Description:P00748
Residue:615
BDBM22795
BDBM22723
NameBDBM22795
Synonyms:1-[(4-chlorophenyl)methyl]-2,3-dihydro-1H-indole-2,3-dione | Isatin-based compound, 15
TypeSmall organic molecule
Emp. Form.C15H10ClNO2
Mol. Mass.271.698
SMILESClc1ccc(CN2C(=O)C(=O)c3ccccc23)cc1