Reaction Details
TargetCoagulation factor XII
LigandBDBM22804
Substrate/CompetitorBDBM22723
Meas. Tech.Enzyme Inhibition Assay
pH7.4±n/a
Temperature298.15±n/a K
Ki 47±2 nM
Citation Hyatt, JLMoak, THatfield, MJTsurkan, LEdwards, CCWierdl, MDanks, MKWadkins, RMPotter, PM Selective inhibition of carboxylesterases by isatins, indole-2,3-diones. J Med Chem50:1876-85 (2007) 
 
Coagulation factor XII
Name:Coagulation factor XII
Type:Enzyme
Mol. Mass.:67810.07
Organism:Homo sapiens (Human)
Description:P00748
Residue:615
BDBM22804
BDBM22723
NameBDBM22804
Synonyms:1-{[(2-bromophenyl)amino]methyl}-2,3-dihydro-1H-indole-2,3-dione | Isatin-based compound, 24
TypeSmall organic molecule
Emp. Form.C15H11BrN2O2
Mol. Mass.331.164
SMILESBrc1ccccc1NCN1C(=O)C(=O)c2ccccc12