Reaction Details
TargetLiver carboxylesterase 1
LigandBDBM22793
Substrate/CompetitorBDBM22723
Meas. Tech.Enzyme Inhibition Assay
Ki 610±n/a nM
Citation Hyatt, JLMoak, THatfield, MJTsurkan, LEdwards, CCWierdl, MDanks, MKWadkins, RMPotter, PM Selective inhibition of carboxylesterases by isatins, indole-2,3-diones. J Med Chem50:1876-85 (2007) 
 
Liver carboxylesterase 1
Name:Liver carboxylesterase 1
Type:Enzyme
Mol. Mass.:62292
Organism:Oryctolagus cuniculus (rabbit)
Description:n/a
Residue:565
BDBM22793
BDBM22723
NameBDBM22793
Synonyms:1‐phenylindole‐2,3‐dione (Compound 6) Isatin-based compound, 13
TypeSmall organic molecule
Emp. Form.C14H9NO2
Mol. Mass.223.2268
SMILESO=C1N(c2ccccc2C1=O)c1ccccc1