Reaction Details
TargetSodium channel protein type 8 subunit alpha
LigandBDBM373761
Substrate/Competitorn/a
Meas. Tech.Electrophysiological Assay (In Vitro Assay)
IC50 36.0±n/a nM
Citation Andrez, JBurford, KNChowdhury, SCohen, CJDehnhardt, CMDevita, RJEmpfield, JRFocken, TGrimwood, MEHasan, SAJohnson, Jr., JPZenova, AY Benzenesulfonamide compounds and their use as therapeutic agents US Patent US10246453 Publication Date 4/2/2019
 
Sodium channel protein type 8 subunit alpha
Name:Sodium channel protein type 8 subunit alpha
Type:PROTEIN
Mol. Mass.:225271.59
Organism:Homo sapiens (Human)
Description:ChEMBL_1516902
Residue:1980
BDBM373761
NameBDBM373761
Synonyms:(S)-3-chloro-4-((1-(3-(difluoromethyl)benzyl)pyrrolidin-3-yl)(methyl)amino)-N-(thiazol-2-yl)benzenesulfonamide US10662184, Example 28 US11299490, Example 28
TypeSmall organic molecule
Emp. Form.C22H23ClF2N4O2S2
Mol. Mass.513.023
SMILESCN([C@H]1CCN(Cc2cccc(c2)C(F)F)C1)c1ccc(cc1Cl)S(=O)(=O)Nc1nccs1