Reaction Details
TargetSodium channel protein type 8 subunit alpha
LigandBDBM373763
Substrate/Competitorn/a
Meas. Tech.Sodium Influx Assay (In Vitro Assay)
IC50 21.0±n/a nM
Citation Andrez, JBurford, KNChowdhury, SCohen, CJDehnhardt, CMDevita, RJEmpfield, JRFocken, TGrimwood, MEHasan, SAJohnson, Jr., JPZenova, AY Benzenesulfonamide compounds and their use as therapeutic agents US Patent US10246453 Publication Date 4/2/2019
 
Sodium channel protein type 8 subunit alpha
Name:Sodium channel protein type 8 subunit alpha
Type:PROTEIN
Mol. Mass.:225271.59
Organism:Homo sapiens (Human)
Description:ChEMBL_1516902
Residue:1980
BDBM373763
NameBDBM373763
Synonyms:(S)-3-chloro-4-((1-(3-chlorobenzyl)pyrrolidin-3-yl)(methyl)amino)-N-(1,2,4-thiadiazol-5-yl)benzenesulfonamide US10815229, Example 30
TypeSmall organic molecule
Emp. Form.C20H21Cl2N5O2S2
Mol. Mass.498.449
SMILESCN([C@H]1CCN(Cc2cccc(Cl)c2)C1)c1ccc(cc1Cl)S(=O)(=O)Nc1ncns1