Reaction Details
TargetSodium channel protein type 8 subunit alpha
LigandBDBM373766
Substrate/Competitorn/a
Meas. Tech.Sodium Influx Assay (In Vitro Assay)
IC50 41.0±n/a nM
Citation Andrez, JBurford, KNChowdhury, SCohen, CJDehnhardt, CMDevita, RJEmpfield, JRFocken, TGrimwood, MEHasan, SAJohnson, Jr., JPZenova, AY Benzenesulfonamide compounds and their use as therapeutic agents US Patent US10246453 Publication Date 4/2/2019
 
Sodium channel protein type 8 subunit alpha
Name:Sodium channel protein type 8 subunit alpha
Type:PROTEIN
Mol. Mass.:225271.59
Organism:Homo sapiens (Human)
Description:ChEMBL_1516902
Residue:1980
BDBM373766
NameBDBM373766
Synonyms:(S)-3-chloro-4-((1-(5-chloro-2-fluorobenzyl)pyrrolidin-3-yl)(methyl)amino)-N-(1,2,4-thiadiazol-5-yl)benzenesulfonamide 2,2,2-trifluoroacetate US10662184, Example 33 US11299490, Example 33
TypeSmall organic molecule
Emp. Form.C20H20Cl2FN5O2S2
Mol. Mass.516.44
SMILESCN([C@H]1CCN(Cc2cc(Cl)ccc2F)C1)c1ccc(cc1Cl)S(=O)(=O)Nc1ncns1