Reaction Details
TargetSodium channel protein type 8 subunit alpha
LigandBDBM373767
Substrate/Competitorn/a
Meas. Tech.Sodium Influx Assay (In Vitro Assay)
IC50 39.0±n/a nM
Citation Andrez, JBurford, KNChowdhury, SCohen, CJDehnhardt, CMDevita, RJEmpfield, JRFocken, TGrimwood, MEHasan, SAJohnson, Jr., JPZenova, AY Benzenesulfonamide compounds and their use as therapeutic agents US Patent US10246453 Publication Date 4/2/2019
 
Sodium channel protein type 8 subunit alpha
Name:Sodium channel protein type 8 subunit alpha
Type:PROTEIN
Mol. Mass.:225271.59
Organism:Homo sapiens (Human)
Description:ChEMBL_1516902
Residue:1980
BDBM373767
NameBDBM373767
Synonyms:(S)-3-chloro-4-((1-(2-fluoro-3-methylbenzyl)pyrrolidin-3-yl)(methyl)amino)-N-(1,2,4-thiadiazol-5-yl)benzenesulfonamide 2,2,2-trifluoroacetate US10815229, Example 34
TypeSmall organic molecule
Emp. Form.C21H23ClFN5O2S2
Mol. Mass.496.021
SMILESCN([C@H]1CCN(Cc2cccc(C)c2F)C1)c1ccc(cc1Cl)S(=O)(=O)Nc1ncns1