Reaction Details
TargetSodium channel protein type 8 subunit alpha
LigandBDBM373851
Substrate/Competitorn/a
Meas. Tech.Sodium Influx Assay (In Vitro Assay)
IC50 58.0±n/a nM
Citation Andrez, JBurford, KNChowdhury, SCohen, CJDehnhardt, CMDevita, RJEmpfield, JRFocken, TGrimwood, MEHasan, SAJohnson, Jr., JPZenova, AY Benzenesulfonamide compounds and their use as therapeutic agents US Patent US10246453 Publication Date 4/2/2019
 
Sodium channel protein type 8 subunit alpha
Name:Sodium channel protein type 8 subunit alpha
Type:PROTEIN
Mol. Mass.:225271.59
Organism:Homo sapiens (Human)
Description:ChEMBL_1516902
Residue:1980
BDBM373851
NameBDBM373851
Synonyms:(S)-2-fluoro-5-methyl-4-(methyl(1-((1-(2,2,2-trifluoroethyl)-1H-pyrazol-3-yl)methyl)pyrrolidin-3-yl)amino)-N-(thiazol-4-yl)benzenesulfonamide US10815229, Example 118
TypeSmall organic molecule
Emp. Form.C21H24F4N6O2S2
Mol. Mass.532.578
SMILESCN([C@H]1CCN(Cc2ccn(CC(F)(F)F)n2)C1)c1cc(F)c(cc1C)S(=O)(=O)Nc1cscn1