Reaction Details
TargetSodium channel protein type 8 subunit alpha
LigandBDBM373956
Substrate/Competitorn/a
Meas. Tech.Sodium Influx Assay (In Vitro Assay)
IC50 9.00±n/a nM
Citation Andrez, JBurford, KNChowdhury, SCohen, CJDehnhardt, CMDevita, RJEmpfield, JRFocken, TGrimwood, MEHasan, SAJohnson, Jr., JPZenova, AY Benzenesulfonamide compounds and their use as therapeutic agents US Patent US10246453 Publication Date 4/2/2019
 
Sodium channel protein type 8 subunit alpha
Name:Sodium channel protein type 8 subunit alpha
Type:PROTEIN
Mol. Mass.:225271.59
Organism:Homo sapiens (Human)
Description:ChEMBL_1516902
Residue:1980
BDBM373956
NameBDBM373956
Synonyms:4-((1-benzylpiperidin-4-yl)oxy)-2,6-difluoro-3-methyl-N-(thiazol-2-yl)benzenesulfonamide 2,2,2-trifluoroacetate US10815229, Example 223
TypeSmall organic molecule
Emp. Form.C22H23F2N3O3S2
Mol. Mass.479.563
SMILESCc1c(F)c(c(F)cc1OC1CCN(Cc2ccccc2)CC1)S(=O)(=O)Nc1nccs1