Reaction Details
TargetSodium channel protein type 8 subunit alpha
LigandBDBM373957
Substrate/Competitorn/a
Meas. Tech.Sodium Influx Assay (In Vitro Assay)
IC50 24.0±n/a nM
Citation Andrez, JBurford, KNChowdhury, SCohen, CJDehnhardt, CMDevita, RJEmpfield, JRFocken, TGrimwood, MEHasan, SAJohnson, Jr., JPZenova, AY Benzenesulfonamide compounds and their use as therapeutic agents US Patent US10246453 Publication Date 4/2/2019
 
Sodium channel protein type 8 subunit alpha
Name:Sodium channel protein type 8 subunit alpha
Type:PROTEIN
Mol. Mass.:225271.59
Organism:Homo sapiens (Human)
Description:ChEMBL_1516902
Residue:1980
BDBM373957
NameBDBM373957
Synonyms:(S)-2,6-difluoro-3-methyl-4-(methyl(1-((6-(trifluoromethyl)pyridin-2-yl)methyl)pyrrolidin-3-yl)amino)-N-(thiazol-4-yl)benzenesulfonamide 2,2,2-trifluoroacetate US10815229, Example 224
TypeSmall organic molecule
Emp. Form.C22H22F5N5O2S2
Mol. Mass.547.564
SMILESCN([C@H]1CCN(Cc2cccc(n2)C(F)(F)F)C1)c1cc(F)c(c(F)c1C)S(=O)(=O)Nc1cscn1