Reaction Details
TargetTyrosine-protein kinase BTK
LigandBDBM374594
Substrate/Competitorn/a
Meas. Tech.25P Btk Enzyme Activity Assay
IC50 0.160±n/a nM
Citation Siu, TAltman, MDAndresen, BMLiu, JKozlowski, JBoga, SBYu, YAnand, RCai, JWang, DLiu, S Indazole and azaindazole Btk inhibitors US Patent US10246457 Publication Date 4/2/2019
 
Tyrosine-protein kinase BTK
Name:Tyrosine-protein kinase BTK
Type:Enzyme
Mol. Mass.:76289.95
Organism:Homo sapiens (Human)
Description:Q06187
Residue:659
BDBM374594
NameBDBM374594
Synonyms:3-amino-5-[3-(6-tert-butyl-8-fluoro-1-oxophthalazin-2(1H)-yl)-2-(hydroxymethyl)phenyl]-1H-indazole-7-carboxamide | US10246457, Example 3
TypeSmall organic molecule
Emp. Form.C27H25FN6O3
Mol. Mass.500.5242
SMILESCC(C)(C)c1cc(F)c2c(cnn(-c3cccc(-c4cc(C(N)=O)c5[nH]nc(N)c5c4)c3CO)c2=O)c1