Reaction Details
TargetTyrosine-protein kinase BTK
LigandBDBM374597
Substrate/Competitorn/a
Meas. Tech.25P Btk Enzyme Activity Assay
IC50 0.150±n/a nM
Citation Siu, TAltman, MDAndresen, BMLiu, JKozlowski, JBoga, SBYu, YAnand, RCai, JWang, DLiu, S Indazole and azaindazole Btk inhibitors US Patent US10246457 Publication Date 4/2/2019
 
Tyrosine-protein kinase BTK
Name:Tyrosine-protein kinase BTK
Type:Enzyme
Mol. Mass.:76289.95
Organism:Homo sapiens (Human)
Description:Q06187
Residue:659
BDBM374597
NameBDBM374597
Synonyms:2-[3-{3-amino-7-[1-(1-methylethyl)-1H-pyrazol-4-yl]-1H-indazol-5-yl}-2-(hydroxymethyl)phenyl]-6-tert-butyl-8-fluorophthalazin-1(2H)-one | US10246457, Example 6
TypeSmall organic molecule
Emp. Form.C32H32FN7O2
Mol. Mass.565.6406
SMILESCC(C)n1cc(cn1)-c1cc(cc2c(N)n[nH]c12)-c1cccc(c1CO)-n1ncc2cc(cc(F)c2c1=O)C(C)(C)C