Reaction Details
TargetLiver carboxylesterase 1
LigandBDBM22858
Substrate/CompetitorBDBM22723
Meas. Tech.Enzyme Inhibition Assay
Ki 15.9±n/a nM
Citation Hyatt, JLWadkins, RMTsurkan, LHicks, LDHatfield, MJEdwards, CCRoss, CRCantalupo, SACrundwell, GDanks, MKGuy, RKPotter, PM Planarity and constraint of the carbonyl groups in 1,2-diones are determinants for selective inhibition of human carboxylesterase 1. J Med Chem50:5727-34 (2007) 
 
Liver carboxylesterase 1
Name:Liver carboxylesterase 1
Type:Protein
Mol. Mass.:62520.83
Organism:Homo sapiens (Human)
Description:n/a
Residue:567
BDBM22858
BDBM22723
NameBDBM22858
Synonyms:1,2-Dione-Based Compound, 15 CHEMBL433282 US9073941, 904
TypeSmall organic molecule
Emp. Form.C14H7NO4
Mol. Mass.253.2097
SMILES[O-][N+](=O)c1ccc-2c(c1)C(=O)C(=O)c1ccccc-21