Reaction Details
TargetHistamine H4 receptor
LigandBDBM22868
Substrate/CompetitorBDBM7966
Meas. Tech.H4R Radioligand Binding Assay
pH7.4±n/a
Temperature310.15±n/a K
Ki>10000±n/a nM
CommentsAnalysis of the [3H]histamine saturation binding yielded a Kd value of 11 +/- 1 and a Bmax value of 1.8 +/- 0.4 pmol/mg protein.
Citation Lim, HDvan Rijn, RMLing, PBakker, RAThurmond, RLLeurs, R Evaluation of histamine H1-, H2-, and H3-receptor ligands at the human histamine H4 receptor: identification of 4-methylhistamine as the first potent and selective H4 receptor agonist. J Pharmacol Exp Ther314:1310-21 (2005) 
 
Histamine H4 receptor
Name:Histamine H4 receptor
Type:G Protein-Coupled Receptor (GPCR)
Mol. Mass.:44517.02
Organism:Homo sapiens (Human)
Description:Binding assays were using CHO cells stably expressing hH4R receptors.
Residue:390
BDBM22868
BDBM7966
NameBDBM22868
Synonyms:11-(1-methylpiperidin-4-ylidene)-6,11-dihydro-5H-benzo[5,6]cyclohepta[1,2-b]pyridine Azatadine | CHEMBL946
TypeSmall organic molecule
Emp. Form.C20H22N2
Mol. Mass.290.4021
SMILES[#6]-[#7]-1-[#6]-[#6]\[#6](-[#6]-[#6]-1)=[#6]-1/c2ccccc2-[#6]-[#6]-c2cccnc-12