Reaction Details
TargetHistamine H4 receptor
LigandBDBM22899
Substrate/CompetitorBDBM7966
Meas. Tech.H4R Radioligand Binding Assay
Ki 25±n/a nM
Citation Lim, HDvan Rijn, RMLing, PBakker, RAThurmond, RLLeurs, R Evaluation of histamine H1-, H2-, and H3-receptor ligands at the human histamine H4 receptor: identification of 4-methylhistamine as the first potent and selective H4 receptor agonist. J Pharmacol Exp Ther314:1310-21 (2005) 
 
Histamine H4 receptor
Name:Histamine H4 receptor
Type:G Protein-Coupled Receptor (GPCR)
Mol. Mass.:44517.02
Organism:Homo sapiens (Human)
Description:Binding assays were using CHO cells stably expressing hH4R receptors.
Residue:390
BDBM22899
BDBM7966
NameBDBM22899
Synonyms:3-ethyl-1-[5-(1H-imidazol-4-yl)pentyl]thiourea VUF 4614
TypeSmall organic molecule
Emp. Form.C11H20N4S
Mol. Mass.240.368
SMILESCCNC(=S)NCCCCCc1cnc[nH]1