Reaction Details
TargetHistamine H3 receptor
LigandBDBM22888
Substrate/CompetitorBDBM22530
Meas. Tech.H3R Radioligand Binding Assay
Ki 13±n/a nM
Citation Lim, HDvan Rijn, RMLing, PBakker, RAThurmond, RLLeurs, R Evaluation of histamine H1-, H2-, and H3-receptor ligands at the human histamine H4 receptor: identification of 4-methylhistamine as the first potent and selective H4 receptor agonist. J Pharmacol Exp Ther314:1310-21 (2005) 
 
Histamine H3 receptor
Name:Histamine H3 receptor
Type:G Protein-Coupled Receptor (GPCR)
Mol. Mass.:48691.47
Organism:Homo sapiens (Human)
Description:Binding assays were using CHO cells stably expressing hH3R receptors.
Residue:445
BDBM22888
BDBM22530
NameBDBM22888
Synonyms:1-[4-(1H-imidazol-5-yl)butyl]-3-methylthiourea CHEMBL12160
TypeSmall organic molecule
Emp. Form.C9H16N4S
Mol. Mass.212.315
SMILESCNC(=S)NCCCCc1cnc[nH]1