Reaction Details
TargetAdenosine deaminase
LigandBDBM22917
Substrate/CompetitorBDBM14487
Meas. Tech.ADA Inhibition Assay
pH7.4±n/a
Temperature295.15±n/a K
Ki 5900±n/a nM
Citation Terasaka, TNakanishi, INakamura, KEikyu, YKinoshita, TNishio, NSato, AKuno, MSeki, NSakane, K Structure-based de novo design of non-nucleoside adenosine deaminase inhibitors. Bioorg Med Chem Lett13:1115-8 (2003) 
 
Adenosine deaminase
Name:Adenosine deaminase
Type:Enzyme
Mol. Mass.:40759.44
Organism:Homo sapiens (Human)
Description:Human recombinant ADA was expressed and purified from an ADA-deficient bacterial strain.
Residue:363
BDBM22917
BDBM14487
NameBDBM22917
Synonyms:1-(1-hydroxy-4-phenylbutan-2-yl)-1H-imidazole-4-carboxamide FR221647 | imidazole-4-carboxamide derivative, 1
TypeSmall organic molecule
Emp. Form.C14H17N3O2
Mol. Mass.259.3037
SMILESNC(=O)c1cn(cn1)C(CO)CCc1ccccc1