Reaction Details
TargetAdenosine deaminase
LigandBDBM22933
Substrate/CompetitorBDBM14487
Meas. Tech.ADA Inhibition Assay
pH7.4±n/a
Temperature295.15±n/a K
Ki 38±n/a nM
Citation Terasaka, TKinoshita, TKuno, MSeki, NTanaka, KNakanishi, I Structure-based design, synthesis, and structure-activity relationship studies of novel non-nucleoside adenosine deaminase inhibitors. J Med Chem47:3730-43 (2004) 
 
Adenosine deaminase
Name:Adenosine deaminase
Type:Enzyme
Mol. Mass.:40759.44
Organism:Homo sapiens (Human)
Description:Human recombinant ADA was expressed and purified from an ADA-deficient bacterial strain.
Residue:363
BDBM22933
BDBM14487
NameBDBM22933
Synonyms:1-[(2R)-1-hydroxy-4-{6-[3-(4-methylphenyl)propanamido]-1H-indol-1-yl}butan-2-yl]-1H-imidazole-4-carboxamide | Hybrid compound 1(FR235999) derivative, 4g
TypeSmall organic molecule
Emp. Form.C26H29N5O3
Mol. Mass.459.5402
SMILESCc1ccc(CCC(=O)Nc2ccc3ccn(CC[C@H](CO)n4cnc(c4)C(N)=O)c3c2)cc1