Reaction Details
TargetAdenosine deaminase
LigandBDBM22947
Substrate/CompetitorBDBM14487
Meas. Tech.ADA Inhibition Assay
pH7.4±n/a
Temperature295.15±n/a K
Ki 4.9±n/a nM
Citation Terasaka, TKinoshita, TKuno, MSeki, NTanaka, KNakanishi, I Structure-based design, synthesis, and structure-activity relationship studies of novel non-nucleoside adenosine deaminase inhibitors. J Med Chem47:3730-43 (2004) 
 
Adenosine deaminase
Name:Adenosine deaminase
Type:Enzyme
Mol. Mass.:40759.44
Organism:Homo sapiens (Human)
Description:Human recombinant ADA was expressed and purified from an ADA-deficient bacterial strain.
Residue:363
BDBM22947
BDBM14487
NameBDBM22947
Synonyms:1-[(2R)-4-{5-[3-(4-chlorophenyl)propoxy]-1-methyl-1H-indol-3-yl}-1-hydroxybutan-2-yl]-1H-imidazole-4-carboxamide Hybrid compound 1(FR235999) derivative, 8c
TypeSmall organic molecule
Emp. Form.C26H29ClN4O3
Mol. Mass.480.986
SMILESCn1cc(CC[C@H](CO)n2cnc(c2)C(N)=O)c2cc(OCCCc3ccc(Cl)cc3)ccc12