Reaction Details
TargetProstaglandin G/H synthase 2
LigandBDBM17638
Substrate/CompetitorBDBM22319
Meas. Tech.Time-Dependent Inhibition Assay
Temperature310.15±n/a K
IC50 750±n/a nM
Commentsextracted
Citation Kalgutkar, ASCrews, BCRowlinson, SWMarnett, ABKozak, KRRemmel, RPMarnett, LJ Biochemically based design of cyclooxygenase-2 (COX-2) inhibitors: facile conversion of nonsteroidal antiinflammatory drugs to potent and highly selective COX-2 inhibitors. Proc Natl Acad Sci U S A97:925-30 (2000) 
 
Prostaglandin G/H synthase 2
Name:Prostaglandin G/H synthase 2
Type:Enzyme
Mol. Mass.:69003.89
Organism:Homo sapiens (Human)
Description:Recombinant Cox-2 provided by Cayman (Cayman Chemical Co.,Ann Arbor, MI).
Residue:604
BDBM17638
BDBM22319
NameBDBM17638
Synonyms:2-{1-[(4-chlorophenyl)carbonyl]-5-methoxy-2-methyl-1H-indol-3-yl}acetic acid Indocin US11478464, Compound Indomethacin US9271961, Indomethacin | indometacin
TypeSmall organic molecule
Emp. Form.C19H16ClNO4
Mol. Mass.357.788
SMILESCOc1ccc2n(C(=O)c3ccc(Cl)cc3)c(C)c(CC(O)=O)c2c1