Reaction Details
TargetProstaglandin G/H synthase 2
LigandBDBM22952
Substrate/CompetitorBDBM22319
Meas. Tech.Time-Dependent Inhibition Assay
Temperature310.15±n/a K
IC50 250±n/a nM
Commentsextracted
Citation Kalgutkar, ASCrews, BCRowlinson, SWMarnett, ABKozak, KRRemmel, RPMarnett, LJ Biochemically based design of cyclooxygenase-2 (COX-2) inhibitors: facile conversion of nonsteroidal antiinflammatory drugs to potent and highly selective COX-2 inhibitors. Proc Natl Acad Sci U S A97:925-30 (2000) 
 
Prostaglandin G/H synthase 2
Name:Prostaglandin G/H synthase 2
Type:Enzyme
Mol. Mass.:69003.89
Organism:Homo sapiens (Human)
Description:Recombinant Cox-2 provided by Cayman (Cayman Chemical Co.,Ann Arbor, MI).
Residue:604
BDBM22952
BDBM22319
NameBDBM22952
Synonyms:CHEMBL73572 methyl 2-{1-[(4-chlorophenyl)carbonyl]-5-methoxy-2-methyl-1H-indol-3-yl}acetate
TypeSmall organic molecule
Emp. Form.C20H18ClNO4
Mol. Mass.371.814
SMILESCOC(=O)Cc1c(C)n(C(=O)c2ccc(Cl)cc2)c2ccc(OC)cc12