Reaction Details
TargetDNA ligase 1
LigandBDBM23031
Substrate/CompetitorBDBM23028
Meas. Tech.FAAH Inhibition Assay
pH9±n/a
Temperature295.15±n/a K
Ki 11±1 nM
IC50 40±n/a nM
Citation Hardouin, CKelso, MJRomero, FARayl, TJLeung, DHwang, ICravatt, BFBoger, DL Structure-activity relationships of alpha-ketooxazole inhibitors of fatty acid amide hydrolase. J Med Chem50:3359-68 (2007) 
 
DNA ligase 1
Name:DNA ligase 1
Type:Enzyme
Mol. Mass.:101721.76
Organism:Homo sapiens (Human)
Description:n/a
Residue:919
BDBM23031
BDBM23028
NameBDBM23031
Synonyms:7-(naphthalen-2-yl)-1-[5-(pyridin-2-yl)-1,3-oxazol-2-yl]heptan-1-one | alpha-ketooxazole, 5d
TypeSmall organic molecule
Emp. Form.C25H24N2O2
Mol. Mass.384.4703
SMILESO=C(CCCCCCc1ccc2ccccc2c1)c1ncc(o1)-c1ccccn1