Reaction Details
TargetDNA ligase 1
LigandBDBM23038
Substrate/CompetitorBDBM23028
Meas. Tech.FAAH Inhibition Assay
pH9±n/a
Temperature295.15±n/a K
Ki 5.8±0.1 nM
IC50 10±n/a nM
Citation Hardouin, CKelso, MJRomero, FARayl, TJLeung, DHwang, ICravatt, BFBoger, DL Structure-activity relationships of alpha-ketooxazole inhibitors of fatty acid amide hydrolase. J Med Chem50:3359-68 (2007) 
 
DNA ligase 1
Name:DNA ligase 1
Type:Enzyme
Mol. Mass.:101721.76
Organism:Homo sapiens (Human)
Description:n/a
Residue:919
BDBM23038
BDBM23028
NameBDBM23038
Synonyms:7-(2-methoxyphenyl)-1-[5-(pyridin-2-yl)-1,3-oxazol-2-yl]heptan-1-one | alpha-ketooxazole, 5j
TypeSmall organic molecule
Emp. Form.C22H24N2O3
Mol. Mass.364.4376
SMILESCOc1ccccc1CCCCCCC(=O)c1ncc(o1)-c1ccccn1