Reaction Details
TargetDNA ligase 1
LigandBDBM23067
Substrate/CompetitorBDBM23028
Meas. Tech.FAAH Inhibition Assay
Temperature298.15±n/a K
Ki 6.7±n/a nM
IC50 30±n/a nM
Commentsextracted
Citation Hardouin, CKelso, MJRomero, FARayl, TJLeung, DHwang, ICravatt, BFBoger, DL Structure-activity relationships of alpha-ketooxazole inhibitors of fatty acid amide hydrolase. J Med Chem50:3359-68 (2007) 
 
DNA ligase 1
Name:DNA ligase 1
Type:Enzyme
Mol. Mass.:101721.76
Organism:Homo sapiens (Human)
Description:n/a
Residue:919
BDBM23067
BDBM23028
NameBDBM23067
Synonyms:7-(4-hexylphenyl)-1-[5-(pyridin-2-yl)-1,3-oxazol-2-yl]heptan-1-one | alpha-ketooxazole, 5nn
TypeSmall organic molecule
Emp. Form.C27H34N2O2
Mol. Mass.418.5711
SMILESCCCCCCc1ccc(CCCCCCC(=O)c2ncc(o2)-c2ccccn2)cc1