Reaction Details
TargetDNA ligase 1
LigandBDBM23099
Substrate/CompetitorBDBM23028
Meas. Tech.FAAH Inhibition Assay
Temperature298.15±n/a K
Ki 7±n/a nM
Commentsextracted
Citation Hardouin, CKelso, MJRomero, FARayl, TJLeung, DHwang, ICravatt, BFBoger, DL Structure-activity relationships of alpha-ketooxazole inhibitors of fatty acid amide hydrolase. J Med Chem50:3359-68 (2007) 
 
DNA ligase 1
Name:DNA ligase 1
Type:Enzyme
Mol. Mass.:101721.76
Organism:Homo sapiens (Human)
Description:n/a
Residue:919
BDBM23099
BDBM23028
NameBDBM23099
Synonyms:7-(3-chlorophenyl)-1-[5-(pyridin-2-yl)-1,3-oxazol-2-yl]hept-6-yn-1-one | alpha-ketooxazole, 4hh
TypeSmall organic molecule
Emp. Form.C21H17ClN2O2
Mol. Mass.364.825
SMILESClc1cccc(c1)C#CCCCCC(=O)c1ncc(o1)-c1ccccn1