Reaction Details
TargetCarboxylic ester hydrolase
LigandBDBM23030
Substrate/CompetitorBDBM23139
Meas. Tech.FAAH Inhibition Assay
Temperature298.15±n/a K
IC50 300±n/a nM
Commentsextracted
Citation Hardouin, CKelso, MJRomero, FARayl, TJLeung, DHwang, ICravatt, BFBoger, DL Structure-activity relationships of alpha-ketooxazole inhibitors of fatty acid amide hydrolase. J Med Chem50:3359-68 (2007) 
 
Carboxylic ester hydrolase
Name:Carboxylic ester hydrolase
Type:Homotrimer; type-B carboxylesterase/lipase family
Mol. Mass.:61960.20
Organism:Homo sapiens (Human)
Description:Q8TDZ9
Residue:565
BDBM23030
BDBM23139
NameBDBM23030
Synonyms:7-(naphthalen-1-yl)-1-[5-(pyridin-2-yl)-1,3-oxazol-2-yl]heptan-1-one | alpha-ketooxazole, 5c
TypeSmall organic molecule
Emp. Form.C25H24N2O2
Mol. Mass.384.4703
SMILESO=C(CCCCCCc1cccc2ccccc12)c1ncc(o1)-c1ccccn1