Reaction Details
TargetCarboxylic ester hydrolase
LigandBDBM23052
Substrate/CompetitorBDBM23139
Meas. Tech.FAAH Inhibition Assay
Temperature298.15±n/a K
IC50 7000±n/a nM
Commentsextracted
Citation Hardouin, CKelso, MJRomero, FARayl, TJLeung, DHwang, ICravatt, BFBoger, DL Structure-activity relationships of alpha-ketooxazole inhibitors of fatty acid amide hydrolase. J Med Chem50:3359-68 (2007) 
 
Carboxylic ester hydrolase
Name:Carboxylic ester hydrolase
Type:Homotrimer; type-B carboxylesterase/lipase family
Mol. Mass.:61960.20
Organism:Homo sapiens (Human)
Description:Q8TDZ9
Residue:565
BDBM23052
BDBM23139
NameBDBM23052
Synonyms:1-[5-(pyridin-2-yl)-1,3-oxazol-2-yl]-7-[2-(trifluoromethyl)phenyl]heptan-1-one | alpha-ketooxazole, 5x
TypeSmall organic molecule
Emp. Form.C22H21F3N2O2
Mol. Mass.402.4095
SMILESFC(F)(F)c1ccccc1CCCCCCC(=O)c1ncc(o1)-c1ccccn1