Reaction Details
TargetCarboxylic ester hydrolase
LigandBDBM23055
Substrate/CompetitorBDBM23139
Meas. Tech.FAAH Inhibition Assay
Temperature298.15±n/a K
IC50 10000±n/a nM
Commentsextracted
Citation Hardouin, CKelso, MJRomero, FARayl, TJLeung, DHwang, ICravatt, BFBoger, DL Structure-activity relationships of alpha-ketooxazole inhibitors of fatty acid amide hydrolase. J Med Chem50:3359-68 (2007) 
 
Carboxylic ester hydrolase
Name:Carboxylic ester hydrolase
Type:Homotrimer; type-B carboxylesterase/lipase family
Mol. Mass.:61960.20
Organism:Homo sapiens (Human)
Description:Q8TDZ9
Residue:565
BDBM23055
BDBM23139
NameBDBM23055
Synonyms:alpha-ketooxazole, 5aa | methyl 2-{7-oxo-7-[5-(pyridin-2-yl)-1,3-oxazol-2-yl]heptyl}benzoate
TypeSmall organic molecule
Emp. Form.C23H24N2O4
Mol. Mass.392.4477
SMILESCOC(=O)c1ccccc1CCCCCCC(=O)c1ncc(o1)-c1ccccn1