Reaction Details
TargetCarboxylic ester hydrolase
LigandBDBM23062
Substrate/CompetitorBDBM23139
Meas. Tech.FAAH Inhibition Assay
Temperature298.15±n/a K
IC50 2000±n/a nM
Commentsextracted
Citation Hardouin, CKelso, MJRomero, FARayl, TJLeung, DHwang, ICravatt, BFBoger, DL Structure-activity relationships of alpha-ketooxazole inhibitors of fatty acid amide hydrolase. J Med Chem50:3359-68 (2007) 
 
Carboxylic ester hydrolase
Name:Carboxylic ester hydrolase
Type:Homotrimer; type-B carboxylesterase/lipase family
Mol. Mass.:61960.20
Organism:Homo sapiens (Human)
Description:Q8TDZ9
Residue:565
BDBM23062
BDBM23139
NameBDBM23062
Synonyms:7-(4-chlorophenyl)-1-[5-(pyridin-2-yl)-1,3-oxazol-2-yl]heptan-1-one | alpha-ketooxazole, 5ii
TypeSmall organic molecule
Emp. Form.C21H21ClN2O2
Mol. Mass.368.857
SMILESClc1ccc(CCCCCCC(=O)c2ncc(o2)-c2ccccn2)cc1