Reaction Details
TargetSphingosine 1-phosphate receptor 2
LigandBDBM22202
Substrate/CompetitorBDBM22202
Meas. Tech.[32P] S1P Binding Assay
pH7.5±n/a
Temperature277.15±n/a K
Ki 3.4±0.18 nM
Citation Kiuchi, MAdachi, KTomatsu, AChino, MTakeda, STanaka, YMaeda, YSato, NMitsutomi, NSugahara, KChiba, K Asymmetric synthesis and biological evaluation of the enantiomeric isomers of the immunosuppressive FTY720-phosphate. Bioorg Med Chem13:425-32 (2005) 
 
Sphingosine 1-phosphate receptor 2
Name:Sphingosine 1-phosphate receptor 2
Type:G Protein-Coupled Receptor (GPCR)
Mol. Mass.:38883.16
Organism:Homo sapiens (Human)
Description:Membranes isolated from S1P2-transfected CHO cells were used in ligand binding assay.
Residue:353
BDBM22202
BDBM22202
NameBDBM22202
Synonyms:S1P [33P]S1P sphingosine-1-phosphate, 32P labeled {[(4Z)-2-amino-3-hydroxyoctadec-4-en-1-yl]oxy}phosphonic acid
Typeradiolabeled ligand
Emp. Form.C18H38NO5P
Mol. Mass.379.4718
SMILESCCCCCCCCCCCCC\C=C/C(O)C(N)COP(O)(O)=O