Reaction Details
TargetSphingosine 1-phosphate receptor 2
LigandBDBM23163
Substrate/CompetitorBDBM22202
Meas. Tech.[32P] S1P Binding Assay
pH7.5±n/a
Temperature277.15±n/a K
Ki>1000±n/a nM
Citation Kiuchi, MAdachi, KTomatsu, AChino, MTakeda, STanaka, YMaeda, YSato, NMitsutomi, NSugahara, KChiba, K Asymmetric synthesis and biological evaluation of the enantiomeric isomers of the immunosuppressive FTY720-phosphate. Bioorg Med Chem13:425-32 (2005) 
 
Sphingosine 1-phosphate receptor 2
Name:Sphingosine 1-phosphate receptor 2
Type:G Protein-Coupled Receptor (GPCR)
Mol. Mass.:38883.16
Organism:Homo sapiens (Human)
Description:Membranes isolated from S1P2-transfected CHO cells were used in ligand binding assay.
Residue:353
BDBM23163
BDBM22202
NameBDBM23163
Synonyms:CHEMBL114606 {2-amino-3-hydroxy-2-[2-(4-octylphenyl)ethyl]propoxy}phosphonic acid
TypeSmall organic molecule
Emp. Form.C19H34NO5P
Mol. Mass.387.4507
SMILESCCCCCCCCc1ccc(CCC(N)(CO)COP(O)(O)=O)cc1