Reaction Details
TargetD-amino-acid oxidase
LigandBDBM23171
Substrate/CompetitorBDBM23167
Meas. Tech.In vitro D-Amino Acid Oxidase Assay
pH8.5±n/a
Temperature295.15±n/a K
IC50 1510±120 nM
Citation Ferraris, DDuvall, BKo, YSThomas, AGRojas, CMajer, PHashimoto, KTsukamoto, T Synthesis and Biological Evaluation of d-Amino Acid Oxidase Inhibitors. J Med Chem51:3357-9 (2008) 
 
D-amino-acid oxidase
Name:D-amino-acid oxidase
Type:Flavoprotein
Mol. Mass.:39338.01
Organism:Sus scrofa (pig)
Description:Homodimer.
Residue:347
BDBM23171
BDBM23167
NameBDBM23171
Synonyms:5-iodo-1,2-benzoxazol-3-ol | Benzo[d]isoxazol-3-ol Derivative, 3d
TypeSmall organic molecule
Emp. Form.C7H4INO2
Mol. Mass.261.0166
SMILESIc1ccc2o[nH]c(=O)c2c1