Reaction Details
TargetD-amino-acid oxidase
LigandBDBM23173
Substrate/CompetitorBDBM23167
Meas. Tech.In vitro D-Amino Acid Oxidase Assay
pH8.5±n/a
Temperature295.15±n/a K
IC50 444±32 nM
Citation Ferraris, DDuvall, BKo, YSThomas, AGRojas, CMajer, PHashimoto, KTsukamoto, T Synthesis and Biological Evaluation of d-Amino Acid Oxidase Inhibitors. J Med Chem51:3357-9 (2008) 
 
D-amino-acid oxidase
Name:D-amino-acid oxidase
Type:Flavoprotein
Mol. Mass.:39338.01
Organism:Sus scrofa (pig)
Description:Homodimer.
Residue:347
BDBM23173
BDBM23167
NameBDBM23173
Synonyms:6-fluoro-1,2-benzoxazol-3-ol | Benzo[d]isoxazol-3-ol Derivative, 3f
TypeSmall organic molecule
Emp. Form.C7H4FNO2
Mol. Mass.153.1106
SMILESFc1ccc2c(c1)o[nH]c2=O