Reaction Details
TargetGlycogen phosphorylase, muscle form
LigandBDBM23197
Substrate/CompetitorBDBM23188
Meas. Tech.Enzyme Inhibition Assay
pH7.2±n/a
Temperature295.15±n/a K
IC50 9000±n/a nM
Citation Wen, XSun, HLiu, JCheng, KZhang, PZhang, LHao, JZhang, LNi, PZographos, SELeonidas, DDAlexacou, KMGimisis, THayes, JMOikonomakos, NG Naturally Occurring Pentacyclic Triterpenes as Inhibitors of Glycogen Phosphorylase: Synthesis, Structure-Activity Relationships, and X-ray Crystallographic Studies. J Med Chem51:3540-54 (2008) 
 
Glycogen phosphorylase, muscle form
Name:Glycogen phosphorylase, muscle form
Type:Enzyme
Mol. Mass.:97296.32
Organism:Oryctolagus cuniculus (rabbit)
Description:Phosphorylation of Ser-15 converts phosphorylase B (unphosphorylated) to phosphorylase A.
Residue:843
BDBM23197
BDBM23188
NameBDBM23197
Synonyms:(1S,2R,4aS,6aS,6bR,10S,12aR,12bR,14bS)-10-hydroxy-1,2,6a,6b,9,9,12a-heptamethyl-1,2,3,4,4a,5,6,6a,6b,7,8,8a,9,10,11,12,12a,12b,13,14b-icosahydropicene-4a-carboxylic acid Ursolic Acid, 10 pentacyclic triterpene compound 10
TypeTerpene
Emp. Form.C30H48O3
Mol. Mass.456.7003
SMILES[H][C@@]12[C@@H](C)[C@H](C)CC[C@@]1(CC[C@]1(C)C2=CC[C@]2([H])[C@@]3(C)CC[C@H](O)C(C)(C)C3CC[C@@]12C)C(O)=O