Reaction Details
TargetL-lactate dehydrogenase
LigandBDBM23228
Substrate/CompetitorBDBM19473
Meas. Tech.Lactate Dehydrogenase Inhibition Assay
pH7±n/a
Temperature298.15±n/a K
IC50 8250±500 nM
Citation Choi, SRPradhan, AHammond, NLChittiboyina, AGTekwani, BLAvery, MA Design, synthesis, and biological evaluation of Plasmodium falciparum lactate dehydrogenase inhibitors. J Med Chem50:3841-50 (2007) 
 
L-lactate dehydrogenase
Name:L-lactate dehydrogenase
Type:Oxidoreductase
Mol. Mass.:34111.90
Organism:Plasmodium falciparum
Description:n/a
Residue:316
BDBM23228
BDBM19473
NameBDBM23228
Synonyms:Oxamic acid derivative, 6 | [(2-cyano-4-{2-[(5-hydroxy-2-{[(4-methoxyphenyl)methyl]carbamoyl}-4-oxo-4H-chromen-7-yl)oxy]ethyl}phenyl)carbamoyl]formic acid
TypeSmall organic molecule
Emp. Form.C29H23N3O9
Mol. Mass.557.5076
SMILESCOc1ccc(CNC(=O)c2cc(=O)c3c(O)cc(OCCc4ccc(NC(=O)C(O)=O)c(c4)C#N)cc3o2)cc1