Reaction Details
TargetL-lactate dehydrogenase
LigandBDBM23223
Substrate/CompetitorBDBM23230
Meas. Tech.Lactate Dehydrogenase Inhibition Assay
IC50 2030±n/a nM
Citation Choi, SRPradhan, AHammond, NLChittiboyina, AGTekwani, BLAvery, MA Design, synthesis, and biological evaluation of Plasmodium falciparum lactate dehydrogenase inhibitors. J Med Chem50:3841-50 (2007) 
 
L-lactate dehydrogenase
Name:L-lactate dehydrogenase
Type:Oxidoreductase
Mol. Mass.:34043.75
Organism:Plasmodium falciparum
Description:n/a
Residue:313
BDBM23223
BDBM23230
NameBDBM23223
Synonyms:7-[8-formyl-1,6,7-trihydroxy-3-methyl-5-(propan-2-yl)naphthalen-2-yl]-2,3,8-trihydroxy-6-methyl-4-(propan-2-yl)naphthalene-1-carbaldehyde Gossypol Gossypol, 4 Tash 1 cid_3503
TypeSmall organic molecule
Emp. Form.C30H30O8
Mol. Mass.518.5544
SMILESCC(C)c1c(O)c(O)c(C=O)c2c(O)c(c(C)cc12)-c1c(C)cc2c(C(C)C)c(O)c(O)c(C=O)c2c1O