Reaction Details
TargetL-lactate dehydrogenase
LigandBDBM23227
Substrate/CompetitorBDBM23230
Meas. Tech.Lactate Dehydrogenase Inhibition Assay
IC50 6760±n/a nM
Citation Choi, SRPradhan, AHammond, NLChittiboyina, AGTekwani, BLAvery, MA Design, synthesis, and biological evaluation of Plasmodium falciparum lactate dehydrogenase inhibitors. J Med Chem50:3841-50 (2007) 
 
L-lactate dehydrogenase
Name:L-lactate dehydrogenase
Type:Oxidoreductase
Mol. Mass.:34043.75
Organism:Plasmodium falciparum
Description:n/a
Residue:313
BDBM23227
BDBM23230
NameBDBM23227
Synonyms:Oxamic acid derivative, 5 | [(4-{2-[(5-hydroxy-2-{[(4-methoxyphenyl)methyl]carbamoyl}-4-oxo-4H-chromen-7-yl)oxy]ethyl}phenyl)carbamoyl]formic acid
TypeSmall organic molecule
Emp. Form.C28H24N2O9
Mol. Mass.532.4982
SMILESCOc1ccc(CNC(=O)c2cc(=O)c3c(O)cc(OCCc4ccc(NC(=O)C(O)=O)cc4)cc3o2)cc1