Reaction Details
TargetL-lactate dehydrogenase
LigandBDBM23250
Substrate/CompetitorBDBM23233
Meas. Tech.Lactate Dehydrogenase Inhibition Assay
pH7.5±n/a
Temperature298.15±n/a K
IC50 81010±n/a nM
Citation Cameron, ARead, JTranter, RWinter, VJSessions, RBBrady, RLVivas, LEaston, AKendrick, HCroft, SLBarros, DLavandera, JLMartin, JJRisco, FGarcía-Ochoa, SGamo, FJSanz, LLeon, LRuiz, JRGabarró, RMallo, AGómez de las Heras, F Identification and activity of a series of azole-based compounds with lactate dehydrogenase-directed anti-malarial activity. J Biol Chem279:31429-39 (2004) 
 
L-lactate dehydrogenase
Name:L-lactate dehydrogenase
Type:Oxidoreductase
Mol. Mass.:34111.90
Organism:Plasmodium falciparum
Description:n/a
Residue:316
BDBM23250
BDBM23233
NameBDBM23250
Synonyms:1,2(1,5)-Isoxazole, IOA9 | 4-hydroxy-1,2-oxazole-3,5-dicarboxylic acid
TypeSmall organic molecule
Emp. Form.C5H3NO6
Mol. Mass.173.0804
SMILESOC(=O)c1noc(C(O)=O)c1O