Reaction Details
TargetPeptidyl-prolyl cis-trans isomerase FKBP1A
LigandBDBM23321
Substrate/CompetitorBDBM23318
Meas. Tech.Peptidyl Prolyl Isomerase (PPIase) Inibition Assay
pH8±n/a
Temperature273.15±n/a K
Ki 10000±n/a nM
Km520000±80000 nM
kcat344±26 1/sec
Citation Wu, YQWilkinson, DELimburg, DLi, JHSauer, HRoss, DLiang, SSpicer, DValentine, HFuller, MGuo, HHoworth, PSoni, RChen, YSteiner, JPHamilton, GS Synthesis of ketone analogues of prolyl and pipecolyl ester FKBP12 ligands. J Med Chem45:3558-68 (2002) 
 
Peptidyl-prolyl cis-trans isomerase FKBP1A
Name:Peptidyl-prolyl cis-trans isomerase FKBP1A
Type:Isomerase
Mol. Mass.:11911.51
Organism:Bos taurus (bovine)
Description:The enzyme was purified from calf thymus. The collected protein was further applied to Sephacryl column, and the fraction contained high PPIase activity was pooled.
Residue:108
BDBM23321
BDBM23318
NameBDBM23321
Synonyms:1-phenyl-2-[(2S)-2-(5-phenylpentanoyl)pyrrolidin-1-yl]ethane-1,2-dione | N-Glyoxylprolyl ketone, 5d
TypeSmall organic molecule
Emp. Form.C23H25NO3
Mol. Mass.363.4495
SMILESO=C(CCCCc1ccccc1)[C@@H]1CCCN1C(=O)C(=O)c1ccccc1