Reaction Details
TargetPeptidyl-prolyl cis-trans isomerase FKBP1A
LigandBDBM23336
Substrate/CompetitorBDBM23318
Meas. Tech.Peptidyl Prolyl Isomerase (PPIase) Inibition Assay
pH8±n/a
Temperature288.15±n/a K
Ki 85±n/a nM
Citation Hudack, RABarta, NSGuo, CDeal, JDong, LFay, LKCaprathe, BChatterjee, AVanderpool, DBigge, CShowalter, RBender, SAugelli-Szafran, CELunney, EHou, X Design, synthesis, and biological activity of novel polycyclic aza-amide FKBP12 ligands. J Med Chem49:1202-6 (2006) 
 
Peptidyl-prolyl cis-trans isomerase FKBP1A
Name:Peptidyl-prolyl cis-trans isomerase FKBP1A
Type:Isomerase
Mol. Mass.:11953.09
Organism:Homo sapiens (Human)
Description:P62942
Residue:108
BDBM23336
BDBM23318
NameBDBM23336
Synonyms:1-{5-methyl-12-oxo-11,17-diazatetracyclo[11.3.1.0^{2,11}.0^{3,8}]heptadeca-3(8),4,6-trien-17-yl}-2-(3,4,5-trimethoxyphenyl)ethane-1,2-dione | Tetracyclic aza-amide, 5b
TypeSmall organic molecule
Emp. Form.C27H30N2O6
Mol. Mass.478.5369
SMILESCOc1cc(cc(OC)c1OC)C(=O)C(=O)N1C2CCCC1C(=O)N1CCc3ccc(C)cc3C21