Reaction Details
TargetPeptidyl-prolyl cis-trans isomerase FKBP1A
LigandBDBM23357
Substrate/CompetitorBDBM23318
Meas. Tech.Peptidyl Prolyl Isomerase (PPIase) Inibition Assay
pH8±n/a
Temperature288.15±n/a K
Ki 282±n/a nM
Citation Hudack, RABarta, NSGuo, CDeal, JDong, LFay, LKCaprathe, BChatterjee, AVanderpool, DBigge, CShowalter, RBender, SAugelli-Szafran, CELunney, EHou, X Design, synthesis, and biological activity of novel polycyclic aza-amide FKBP12 ligands. J Med Chem49:1202-6 (2006) 
 
Peptidyl-prolyl cis-trans isomerase FKBP1A
Name:Peptidyl-prolyl cis-trans isomerase FKBP1A
Type:Isomerase
Mol. Mass.:11953.09
Organism:Homo sapiens (Human)
Description:P62942
Residue:108
BDBM23357
BDBM23318
NameBDBM23357
Synonyms:1-(2,3-dichlorophenyl)-2-{4,6-dimethoxy-12-oxo-11,17-diazatetracyclo[11.3.1.0^{2,11}.0^{3,8}]heptadeca-3(8),4,6-trien-17-yl}ethane-1,2-dione | Tetracyclic aza-amide, 6m
TypeSmall organic molecule
Emp. Form.C25H24Cl2N2O5
Mol. Mass.503.374
SMILESCOc1cc2CCN3C(C4CCCC(N4C(=O)C(=O)c4cccc(Cl)c4Cl)C3=O)c2c(OC)c1